{"text_format":"1","workbook":"xlsx","n_sheets":4,"sheets":["Dryer","Results Summary","Calculations","Datasets"],"not_rendered":{"charts":0,"images":17,"macros":1,"external_links":1,"defined_names":33,"comments":0,"pivot_tables":0},"unopened":[],"bounds":{"document_bytes":16777216,"sheet_cells":100000,"rows_first":2000,"rows_last":500,"rows_between":2000,"halvings":0,"cell_chars":16384,"cell_head_chars":4096},"cells_cut":0,"cells_raw":0,"read":"whole","date_system":"1900"}

{"sheet":"Dryer","index":0,"n_rows":87,"n_cols":21,"rows_kept":87,"cut":false,"hidden":false,"merged":[[8,19,9,19],[8,20,9,20],[84,0,84,1],[74,0,74,1],[75,0,75,1],[76,0,76,1],[77,0,77,1],[78,0,78,1],[69,0,69,1],[70,0,70,1],[71,0,71,1],[72,0,72,1],[73,0,73,1],[63,0,63,1],[85,0,85,1],[86,0,86,1],[79,0,79,1],[80,0,80,1],[81,0,81,1],[82,0,82,1],[83,0,83,1],[64,0,64,1],[65,0,65,1],[67,0,67,1],[68,0,68,1],[59,0,59,1],[60,0,60,1],[61,0,61,1],[62,0,62,1],[53,0,53,1],[54,0,54,1],[55,0,55,1],[52,0,52,1],[47,0,47,1],[48,0,48,1],[49,0,49,1],[50,0,50,1],[51,0,51,1],[42,0,42,1],[43,0,43,1],[44,0,44,1],[45,0,45,1],[46,0,46,1],[37,0,37,1],[38,0,38,1],[39,0,39,1],[40,0,40,1],[41,0,41,1],[5,12,5,15],[6,3,6,6],[6,12,6,15],[36,0,36,1],[8,0,8,2],[8,3,8,5],[8,12,8,14],[28,0,28,1],[29,0,29,1],[30,0,30,1],[31,0,31,1],[34,0,34,1],[33,0,33,1],[32,0,32,1],[8,9,8,11],[9,0,9,2],[10,0,10,2],[10,3,10,5],[10,9,10,11],[10,12,10,14],[9,12,9,14],[9,3,9,5],[9,9,9,11]]}
[null,null,null,null,null,null,null,null,null,null,null,null,null,null,null,null,null,"Essential Unit Conversion"]
["Universal Calculation Spreadsheets"]
["Dryers",null,null,null,null,null,null,null,null,null,null,null,null,null,null,null,null,"From ",null,"To"]
[null,null,null,null,null,null,null,null,null,null,null,null,null,null,null,null,null,null,"MMSCF",{"$f":"R4*1020","v":0},"MMBtu"]
["Please, enter information describing the Dryer"]
[null,null,null,null,null,null,null,null,null,null,null,null,null,null,null,null,null,null,"lb/MMSCF",{"$f":"R6/1020","v":0},"lb/MMBtu"]
[null,null,null,"Current Capacity",null,null,null,null,null,null,null,null,"Maximum Proposed Capacity"]
[]
{"$rows_left_out":80}
{"sheet":"Results Summary","index":1,"n_rows":46,"n_cols":11,"rows_kept":46,"cut":false,"hidden":false,"merged":[[41,0,41,2],[41,4,41,6],[41,8,41,10],[5,4,6,4],[5,8,6,8],[5,1,5,2],[5,5,5,6],[5,9,5,10],[17,0,17,2],[17,4,17,6],[36,4,36,6],[36,0,36,2],[17,8,17,10],[36,8,36,10],[5,0,6,0]]}
[]
["Universal Calculation Spreadsheets"]
["Results Summary"]
[]
["Non-Fugitive PTE"]
["Pollutants","Current PTE",null,null,"Pollutants","Total PTE after Project","DDGS dryers",null,"Pollutants","Project PTE"]
[null,"(lb/hr)","(ton/yr)",null,null,"(lb/hr)","(ton/yr)",null,null,"(lb/hr)","(ton/yr)"]
["  PMfilterable",{"$f":"Calculations!CJ7","v":0},{"$f":"Calculations!CW7","v":0},null,"  PMfilterable",{"$f":"Calculations!CJ48","v":0},{"$f":"Calculations!CW48","v":0},null,"  PMfilterable",{"$f":"F8-B8","v":0},{"$f":"G8-C8","v":0}]
{"$rows_left_out":39}
{"sheet":"Calculations","index":2,"n_rows":85,"n_cols":101,"rows_kept":85,"cut":false,"hidden":false,"merged":[[72,1,72,10],[72,13,72,22],[45,37,46,37],[46,25,46,35],[46,38,46,48],[54,1,54,10],[54,13,54,22],[45,12,46,12],[46,1,46,10],[45,24,46,24],[2,37,2,48],[4,37,5,37],[5,38,5,48],[44,0,44,10],[44,12,44,22],[44,24,44,35],[43,37,43,48],[31,1,31,10],[13,1,13,10],[13,13,13,22],[31,13,31,22],[41,0,41,3],[3,12,3,22],[5,25,5,35],[3,24,3,35],[4,24,5,24],[4,12,5,12],[0,0,0,3],[4,0,5,0],[5,1,5,10],[3,0,3,10],[45,50,46,50],[45,63,46,63],[46,51,46,61],[46,64,46,74],[45,0,46,0],[33,57,33,59],[10,63,10,74],[11,63,12,63],[12,64,12,74],[44,63,44,74],[10,50,10,61],[11,50,12,50],[12,51,12,61],[44,50,44,61],[33,51,33,53],[3,50,3,61],[3,63,3,74],[3,76,3,87],[3,89,3,100],[4,76,5,76],[4,89,5,89],[5,77,5,87],[5,90,5,100],[4,50,5,50],[4,63,5,63],[5,51,5,61],[5,64,5,74],[44,76,44,87],[44,89,44,100],[45,76,46,76],[45,89,46,89],[46,77,46,87],[46,90,46,100],[74,51,74,53],[74,57,74,59],[51,63,51,74],[52,50,53,50],[52,63,53,63],[53,51,53,61],[53,64,53,74],[51,50,51,61]]}
["Drying Operations"]
["Emissions from Drying - Drying Process Emissions"]
[null,null,null,null,null,null,null,null,null,null,null,null,null,null,null,null,null,null,null,null,null,null,null,null,null,null,null,null,null,null,null,null,null,null,null,null,null,"PTE in ton/yr = PTE in lb/hr x annual hours limit / 2000"]
["Emission Factors*",null,null,null,null,null,null,null,null,null,null,null,"Chosen Emission Factors: Manufacturer's Guarantee (If Available) or AP-42 in lb/MMBtu*",null,null,null,null,null,null,null,null,null,null,null,"PTE in lb/hr = Emission Factor x Maximum Rated Capacity, MMBtu/hr",null,null,null,null,null,null,null,null,null,null,null,null,"Annual hours limit",{"$f":"IF(Dryer!D15=0,0,Dryer!I15/Dryer!D15)","v":0},{"$f":"IF(Dryer!D16=0,0,Dryer!I16/Dryer!D16)","v":0},{"$f":"IF(Dryer!D17=0,0,Dryer!I17/Dryer!D17)","v":0},{"$f":"IF(Dryer!D18=0,0,Dryer!I18/Dryer!D18)","v":0},{"$f":"IF(Dryer!D19=0,0,Dryer!I19/Dryer!D19)","v":0},{"$f":"IF(Dryer!D20=0,0,Dryer!I20/Dryer!D20)","v":0},{"$f":"IF(Dryer!D21=0,0,Dryer!I21/Dryer!D21)","v":0},{"$f":"IF(Dryer!D22=0,0,Dryer!I22/Dryer!D22)","v":0},{"$f":"IF(Dryer!D23=0,0,Dryer!I23/Dryer!D23)","v":0},{"$f":"IF(Dryer!D24=0,0,Dryer!I24/Dryer!D24)","v":0},null,null,"PTE in lb/hr based on grain drying process = Emission Factor (lb/ton) x Maximum permitted hourly rate (ton/hr)",null,null,null,null,null,null,null,null,null,null,null,null,"PTE in lb/yr based on grain drying process = Emission Factor (lb/ton) x Maximum permitted annual rate (ton/yr)",null,null,null,null,null,null,null,null,null,null,null,null,"Final PTE in lb/hr = Combustion Emissions + Process Emissions",null,null,null,null,null,null,null,null,null,null,null,null,"Final PTE in ton/yr = Combustion Emissions + Process Emissions"]
["Pollutant","1st Dryer","2nd Dryer","3rd Dryer","4th Dryer","5th Dryer","6th Dryer","7th Dryer","8th Dryer","9th Dryer","10th Dryer",null,"Pollutant","1st Dryer","2nd Dryer","3rd Dryer","4th Dryer","5th Dryer","6th Dryer","7th Dryer","8th Dryer","9th Dryer","10th Dryer",null,"Pollutant","1st Dryer","2nd Dryer","3rd Dryer","4th Dryer","5th Dryer","6th Dryer","7th Dryer","8th Dryer","9th Dryer","10th Dryer","Total ",null,"Pollutant","1st Dryer","2nd Dryer","3rd Dryer","4th Dryer","5th Dryer","6th Dryer","7th Dryer","8th Dryer","9th Dryer","10th Dryer","Total ",null,"Pollutant","1st Dryer","2nd Dryer","3rd Dryer","4th Dryer","5th Dryer","6th Dryer","7th Dryer","8th Dryer","9th Dryer","10th Dryer","Total ",null,"Pollutant","1st Dryer","2nd Dryer","3rd Dryer","4th Dryer","5th Dryer","6th Dryer","7th Dryer","8th Dryer","9th Dryer","10th Dryer","Total ",null,"Pollutant","1st Dryer","2nd Dryer","3rd Dryer","4th Dryer","5th Dryer","6th Dryer","7th Dryer","8th Dryer","9th Dryer","10th Dryer","Total ",null,"Pollutant","1st Dryer","2nd Dryer","3rd Dryer","4th Dryer","5th Dryer","6th Dryer","7th Dryer","8th Dryer","9th Dryer","10th Dryer","Total "]
[null,"(lb/MMscf)",null,null,null,null,null,null,null,null,null,null,null,null,null,null,null,null,null,null,null,null,null,null,null,"(lb/hr)",null,null,null,null,null,null,null,null,null,null,null,null,"(ton/year)",null,null,null,null,null,null,null,null,null,null,null,null,"(lb/hr)",null,null,null,null,null,null,null,null,null,null,null,null,"(lb/year)",null,null,null,null,null,null,null,null,null,null,null,null,"(lb/hr)",null,null,null,null,null,null,null,null,null,null,null,null,"(ton/year)"]
["PMfilterable",7.6,7.6,7.6,7.6,7.6,7.6,7.6,7.6,7.6,7.6,null,"PMfilterable",{"$f":"IF(Dryer!C29=0,B7/1020,Dryer!C29)","v":7.4509803921568628E-3},{"$f":"IF(Dryer!D29=0,C7/1020,Dryer!D29)","v":7.4509803921568628E-3},{"$f":"IF(Dryer!E29=0,D7/1020,Dryer!E29)","v":7.4509803921568628E-3},{"$f":"IF(Dryer!F29=0,E7/1020,Dryer!F29)","v":7.4509803921568628E-3},{"$f":"IF(Dryer!G29=0,F7/1020,Dryer!G29)","v":7.4509803921568628E-3},{"$f":"IF(Dryer!H29=0,G7/1020,Dryer!H29)","v":7.4509803921568628E-3},{"$f":"IF(Dryer!I29=0,H7/1020,Dryer!I29)","v":7.4509803921568628E-3},{"$f":"IF(Dryer!J29=0,I7/1020,Dryer!J29)","v":7.4509803921568628E-3},{"$f":"IF(Dryer!K29=0,J7/1020,Dryer!K29)","v":7.4509803921568628E-3},{"$f":"IF(Dryer!L29=0,K7/1020,Dryer!L29)","v":7.4509803921568628E-3},null,"PMfilterable",{"$f":"IF(AZ27=1,N7*Dryer!$F$15,N7*Dryer!$F$15*$BA$40*(1-$BA$41))","v":0},{"$f":"IF(BA27=1,O7*Dryer!$F$16,O7*Dryer!$F$16*$BA$40*(1-$BA$41))","v":0},{"$f":"IF(BB27=1,P7*Dryer!$F$17,P7*Dryer!$F$17*$BA$40*(1-$BA$41))","v":0},{"$f":"IF(BC27=1,Q7*Dryer!$F$18,Q7*Dryer!$F$18*$BA$40*(1-$BA$41))","v":0},{"$f":"IF(BD27=1,R7*Dryer!$F$19,R7*Dryer!$F$19*$BA$40*(1-$BA$41))","v":0},{"$f":"IF(BE27=1,S7*Dryer!$F$20,S7*Dryer!$F$20*$BA$40*(1-$BA$41))","v":0},{"$f":"IF(BF27=1,T7*Dryer!$F$21,T7*Dryer!$F$21*$BA$40*(1-$BA$41))","v":0},{"$f":"IF(BG27=1,U7*Dryer!$F$22,U7*Dryer!$F$22*$BA$40*(1-$BA$41))","v":0},{"$f":"IF(BH27=1,V7*Dryer!$F$23,V7*Dryer!$F$23*$BA$40*(1-$BA$41))","v":0},{"$f":"IF(BI27=1,W7*Dryer!$F$24,W7*Dryer!$F$24*$BA$40*(1-$BA$41))","v":0},{"$f":"SUM(Z7:AI7)","v":0},null,"PMfilterable",{"$f":"IF(AM$4=0,Z7*8760/2000,Z7*AM$4/2000)","v":0},{"$f":"IF(AN$4=0,AA7*8760/2000,AA7*AN$4/2000)","v":0},0,0,0,0,0,0,0,0,{"$f":"SUM(AM7:AV7)","v":0},null,"PMfilterable",{"$f":"IF(Dryer!G15=\"\",3,LOOKUP(Dryer!G15,Calculations!$AZ$35:$BB$35,Calculations!$AZ$36:$BB$36))*Dryer!D15","v":0},{"$f":"IF(Dryer!G16=\"\",3,LOOKUP(Dryer!G16,Calculations!$AZ$35:$BB$35,Calculations!$AZ$36:$BB$36))*Dryer!D16","v":0},{"$f":"IF(Dryer!G17=\"\",3,LOOKUP(Dryer!G17,Calculations!$AZ$35:$BB$35,Calculations!$AZ$36:$BB$36))*Dryer!D17","v":0},{"$f":"IF(Dryer!G18=\"\",3,LOOKUP(Dryer!G18,Calculations!$AZ$35:$BB$35,Calculations!$AZ$36:$BB$36))*Dryer!D18","v":0},{"$f":"IF(Dryer!G19=\"\",3,LOOKUP(Dryer!G19,Calculations!$AZ$35:$BB$35,Calculations!$AZ$36:$BB$36))*Dryer!D19","v":0},{"$f":"IF(Dryer!G20=\"\",3,LOOKUP(Dryer!G20,Calculations!$AZ$35:$BB$35,Calculations!$AZ$36:$BB$36))*Dryer!D20","v":0},{"$f":"IF(Dryer!G21=\"\",3,LOOKUP(Dryer!G21,Calculations!$AZ$35:$BB$35,Calculations!$AZ$36:$BB$36))*Dryer!D21","v":0},{"$f":"IF(Dryer!G22=\"\",3,LOOKUP(Dryer!G22,Calculations!$AZ$35:$BB$35,Calculations!$AZ$36:$BB$36))*Dryer!D22","v":0},{"$f":"IF(Dryer!G23=\"\",3,LOOKUP(Dryer!G23,Calculations!$AZ$35:$BB$35,Calculations!$AZ$36:$BB$36))*Dryer!D23","v":0},{"$f":"IF(Dryer!G24=\"\",3,LOOKUP(Dryer!G24,Calculations!$AZ$35:$BB$35,Calculations!$AZ$36:$BB$36))*Dryer!D24","v":0},{"$f":"IF(BC28=0,SUM(AZ7:BI7),IF(BC28<=BC30,BC28*BA36,IF(BC28<=(BC30+BC31),(BC30*BA36+(BC28-BC30)*BB36),(BC30*BA36+BC31*BB36+(BC28-BC30-BC31)*AZ36))))","v":0},null,"PMfilterable",{"$f":"IF(Dryer!G15=\"\",3,LOOKUP(Dryer!G15,Calculations!$AZ$35:$BB$35,Calculations!$AZ$36:$BB$36))*Dryer!D15*IF(AM4=0,8760,AM4)","v":0},{"$f":"IF(Dryer!G16=\"\",3,LOOKUP(Dryer!G16,Calculations!$AZ$35:$BB$35,Calculations!$AZ$36:$BB$36))*Dryer!D16*IF(AN4=0,8760,AN4)","v":0},{"$f":"IF(Dryer!G17=\"\",3,LOOKUP(Dryer!G17,Calculations!$AZ$35:$BB$35,Calculations!$AZ$36:$BB$36))*Dryer!D17*IF(AO4=0,8760,AO4)","v":0},{"$f":"IF(Dryer!G18=\"\",3,LOOKUP(Dryer!G18,Calculations!$AZ$35:$BB$35,Calculations!$AZ$36:$BB$36))*Dryer!D18*IF(AP4=0,8760,AP4)","v":0},{"$f":"IF(Dryer!G19=\"\",3,LOOKUP(Dryer!G19,Calculations!$AZ$35:$BB$35,Calculations!$AZ$36:$BB$36))*Dryer!D19*IF(AQ4=0,8760,AQ4)","v":0},{"$f":"IF(Dryer!G20=\"\",3,LOOKUP(Dryer!G20,Calculations!$AZ$35:$BB$35,Calculations!$AZ$36:$BB$36))*Dryer!D20*IF(AR4=0,8760,AR4)","v":0},{"$f":"IF(Dryer!G21=\"\",3,LOOKUP(Dryer!G21,Calculations!$AZ$35:$BB$35,Calculations!$AZ$36:$BB$36))*Dryer!D21*IF(AS4=0,8760,AS4)","v":0},{"$f":"IF(Dryer!G22=\"\",3,LOOKUP(Dryer!G22,Calculations!$AZ$35:$BB$35,Calculations!$AZ$36:$BB$36))*Dryer!D22*IF(AT4=0,8760,AT4)","v":0},{"$f":"IF(Dryer!G23=\"\",3,LOOKUP(Dryer!G23,Calculations!$AZ$35:$BB$35,Calculations!$AZ$36:$BB$36))*Dryer!D23*IF(AU4=0,8760,AU4)","v":0},{"$f":"IF(Dryer!G24=\"\",3,LOOKUP(Dryer!G24,Calculations!$AZ$35:$BB$35,Calculations!$AZ$36:$BB$36))*Dryer!D24*IF(AV4=0,8760,AV4)","v":0},{"$f":"IF(BC29=0,SUM(BM7:BV7),IF(BC29<=BC30*8760,BC29*BA36,IF(BC29<=(BC30+BC31)*8760,(BC30*BA36+(BC29-BC30)*BB36),(BC30*BA36+BC31*BB36+(BC29-BC30-BC31)*AZ36))))","v":0},null,"PMfilterable",{"$f":"Z7+AZ14","v":0},{"$f":"AA7+BA14","v":0},0,0,0,0,0,0,0,0,{"$f":"AJ7+BJ14","v":0},null,"PMfilterable",{"$f":"AM7+BM14/2000","v":0},{"$f":"AN7+BN14/2000","v":0},0,0,0,0,0,0,0,0,0]
["PM10",7.6,7.6,7.6,7.6,7.6,7.6,7.6,7.6,7.6,7.6,null,"PM10",{"$f":"IF(Dryer!C30=0,B8/1020,Dryer!C30)","v":7.4509803921568628E-3},{"$f":"IF(Dryer!D30=0,C8/1020,Dryer!D30)","v":7.4509803921568628E-3},{"$f":"IF(Dryer!E30=0,D8/1020,Dryer!E30)","v":7.4509803921568628E-3},{"$f":"IF(Dryer!F30=0,E8/1020,Dryer!F30)","v":7.4509803921568628E-3},{"$f":"IF(Dryer!G30=0,F8/1020,Dryer!G30)","v":7.4509803921568628E-3},{"$f":"IF(Dryer!H30=0,G8/1020,Dryer!H30)","v":7.4509803921568628E-3},{"$f":"IF(Dryer!I30=0,H8/1020,Dryer!I30)","v":7.4509803921568628E-3},{"$f":"IF(Dryer!J30=0,I8/1020,Dryer!J30)","v":7.4509803921568628E-3},{"$f":"IF(Dryer!K30=0,J8/1020,Dryer!K30)","v":7.4509803921568628E-3},{"$f":"IF(Dryer!L30=0,K8/1020,Dryer!L30)","v":7.4509803921568628E-3},null,"PM10",{"$f":"IF(AZ27=1,N8*Dryer!$F$15,N8*Dryer!$F$15*$BA$40*(1-$BA$41))","v":0},{"$f":"IF(BA27=1,O8*Dryer!$F$16,O8*Dryer!$F$16*$BA$40*(1-$BA$41))","v":0},{"$f":"IF(BB27=1,P8*Dryer!$F$17,P8*Dryer!$F$17*$BA$40*(1-$BA$41))","v":0},{"$f":"IF(BC27=1,Q8*Dryer!$F$18,Q8*Dryer!$F$18*$BA$40*(1-$BA$41))","v":0},{"$f":"IF(BD27=1,R8*Dryer!$F$19,R8*Dryer!$F$19*$BA$40*(1-$BA$41))","v":0},{"$f":"IF(BE27=1,S8*Dryer!$F$20,S8*Dryer!$F$20*$BA$40*(1-$BA$41))","v":0},{"$f":"IF(BF27=1,T8*Dryer!$F$21,T8*Dryer!$F$21*$BA$40*(1-$BA$41))","v":0},{"$f":"IF(BG27=1,U8*Dryer!$F$22,U8*Dryer!$F$22*$BA$40*(1-$BA$41))","v":0},{"$f":"IF(BH27=1,V8*Dryer!$F$23,V8*Dryer!$F$23*$BA$40*(1-$BA$41))","v":0},{"$f":"IF(BI27=1,W8*Dryer!$F$24,W8*Dryer!$F$24*$BA$40*(1-$BA$41))","v":0},{"$f":"SUM(Z8:AI8)","v":0},null,"PM10",{"$f":"IF(AM$4=0,Z8*8760/2000,Z8*AM$4/2000)","v":0},{"$f":"IF(AN$4=0,AA8*8760/2000,AA8*AN$4/2000)","v":0},{"$f":"IF(AO$4=0,AB8*8760/2000,AB8*AO$4/2000)","v":0},{"$f":"IF(AP$4=0,AC8*8760/2000,AC8*AP$4/2000)","v":0},{"$f":"IF(AQ$4=0,AD8*8760/2000,AD8*AQ$4/2000)","v":0},{"$f":"IF(AR$4=0,AE8*8760/2000,AE8*AR$4/2000)","v":0},{"$f":"IF(AS$4=0,AF8*8760/2000,AF8*AS$4/2000)","v":0},{"$f":"IF(AT$4=0,AG8*8760/2000,AG8*AT$4/2000)","v":0},{"$f":"IF(AU$4=0,AH8*8760/2000,AH8*AU$4/2000)","v":0},{"$f":"IF(AV$4=0,AI8*8760/2000,AI8*AV$4/2000)","v":0},{"$f":"SUM(AM8:AV8)","v":0},null,"PM10",{"$f":"IF(Dryer!G15=\"\",0.75,LOOKUP(Dryer!G15,Calculations!$AZ$35:$BB$35,Calculations!$AZ$37:$BB$37))*Dryer!D15","v":0},{"$f":"IF(Dryer!G16=\"\",0.75,LOOKUP(Dryer!G16,Calculations!$AZ$35:$BB$35,Calculations!$AZ$37:$BB$37))*Dryer!D16","v":0},{"$f":"IF(Dryer!G17=\"\",0.75,LOOKUP(Dryer!G17,Calculations!$AZ$35:$BB$35,Calculations!$AZ$37:$BB$37))*Dryer!D17","v":0},{"$f":"IF(Dryer!G18=\"\",0.75,LOOKUP(Dryer!G18,Calculations!$AZ$35:$BB$35,Calculations!$AZ$37:$BB$37))*Dryer!D18","v":0},{"$f":"IF(Dryer!G19=\"\",0.75,LOOKUP(Dryer!G19,Calculations!$AZ$35:$BB$35,Calculations!$AZ$37:$BB$37))*Dryer!D19","v":0},{"$f":"IF(Dryer!G20=\"\",0.75,LOOKUP(Dryer!G20,Calculations!$AZ$35:$BB$35,Calculations!$AZ$37:$BB$37))*Dryer!D20","v":0},{"$f":"IF(Dryer!G21=\"\",0.75,LOOKUP(Dryer!G21,Calculations!$AZ$35:$BB$35,Calculations!$AZ$37:$BB$37))*Dryer!D21","v":0},{"$f":"IF(Dryer!G22=\"\",0.75,LOOKUP(Dryer!G22,Calculations!$AZ$35:$BB$35,Calculations!$AZ$37:$BB$37))*Dryer!D22","v":0},{"$f":"IF(Dryer!G23=\"\",0.75,LOOKUP(Dryer!G23,Calculations!$AZ$35:$BB$35,Calculations!$AZ$37:$BB$37))*Dryer!D23","v":0},{"$f":"IF(Dryer!G24=\"\",0.75,LOOKUP(Dryer!G24,Calculations!$AZ$35:$BB$35,Calculations!$AZ$37:$BB$37))*Dryer!D24","v":0},{"$f":"IF(BC28=0,SUM(AZ8:BI8),IF(BC28<=BC30,BC28*BA37,IF(BC28<=(BC30+BC31),(BC30*BA37+(BC28-BC30)*BB37),(BC30*BA37+BC31*BB37+(BC28-BC30-BC31)*AZ37))))","v":0},null,"PM10",{"$f":"IF(Dryer!G15=\"\",0.75,LOOKUP(Dryer!G15,Calculations!$AZ$35:$BB$35,Calculations!$AZ$37:$BB$37))*Dryer!D15*IF(AM4=0,8760,AM4)","v":0},{"$f":"IF(Dryer!G16=\"\",0.75,LOOKUP(Dryer!G16,Calculations!$AZ$35:$BB$35,Calculations!$AZ$37:$BB$37))*Dryer!D16*IF(AN4=0,8760,AN4)","v":0},{"$f":"IF(Dryer!G17=\"\",0.75,LOOKUP(Dryer!G17,Calculations!$AZ$35:$BB$35,Calculations!$AZ$37:$BB$37))*Dryer!D17*IF(AO4=0,8760,AO4)","v":0},{"$f":"IF(Dryer!G18=\"\",0.75,LOOKUP(Dryer!G18,Calculations!$AZ$35:$BB$35,Calculations!$AZ$37:$BB$37))*Dryer!D18*IF(AP4=0,8760,AP4)","v":0},{"$f":"IF(Dryer!G19=\"\",0.75,LOOKUP(Dryer!G19,Calculations!$AZ$35:$BB$35,Calculations!$AZ$37:$BB$37))*Dryer!D19*IF(AQ4=0,8760,AQ4)","v":0},{"$f":"IF(Dryer!G20=\"\",0.75,LOOKUP(Dryer!G20,Calculations!$AZ$35:$BB$35,Calculations!$AZ$37:$BB$37))*Dryer!D20*IF(AR4=0,8760,AR4)","v":0},{"$f":"IF(Dryer!G21=\"\",0.75,LOOKUP(Dryer!G21,Calculations!$AZ$35:$BB$35,Calculations!$AZ$37:$BB$37))*Dryer!D21*IF(AS4=0,8760,AS4)","v":0},{"$f":"IF(Dryer!G22=\"\",0.75,LOOKUP(Dryer!G22,Calculations!$AZ$35:$BB$35,Calculations!$AZ$37:$BB$37))*Dryer!D22*IF(AT4=0,8760,AT4)","v":0},{"$f":"IF(Dryer!G23=\"\",0.75,LOOKUP(Dryer!G23,Calculations!$AZ$35:$BB$35,Calculations!$AZ$37:$BB$37))*Dryer!D23*IF(AU4=0,8760,AU4)","v":0},{"$f":"IF(Dryer!G24=\"\",0.75,LOOKUP(Dryer!G24,Calculations!$AZ$35:$BB$35,Calculations!$AZ$37:$BB$37))*Dryer!D24*IF(AV4=0,8760,AV4)","v":0},{"$f":"IF(BC29=0,SUM(BM8:BV8),IF(BC29<=BC30*8760,BC29*BA37,IF(BC29<=(BC30+BC31)*8760,(BC30*BA37+(BC29-BC30)*BB37),(BC30*BA37+BC31*BB37+(BC29-BC30-BC31)*AZ37))))","v":0},null,"PM10",{"$f":"Z8+AZ15","v":0},{"$f":"AA8+BA15","v":0},{"$f":"AB8+BB15","v":0},{"$f":"AC8+BC15","v":0},{"$f":"AD8+BD15","v":0},{"$f":"AE8+BE15","v":0},{"$f":"AF8+BF15","v":0},{"$f":"AG8+BG15","v":0},{"$f":"AH8+BH15","v":0},{"$f":"AI8+BI15","v":0},{"$f":"AJ8+BJ15","v":0},null,"PM10",{"$f":"AM8+BM15/2000","v":0},{"$f":"AN8+BN15/2000","v":0},{"$f":"AO8+BO15/2000","v":0},{"$f":"AP8+BP15/2000","v":0},{"$f":"AQ8+BQ15/2000","v":0},{"$f":"AR8+BR15/2000","v":0},{"$f":"AS8+BS15/2000","v":0},{"$f":"AT8+BT15/2000","v":0},{"$f":"AU8+BU15/2000","v":0},{"$f":"AV8+BV15/2000","v":0},{"$f":"AW8+BW15/2000","v":0}]
{"$rows_left_out":78}
{"sheet":"Datasets","index":3,"n_rows":22,"n_cols":44,"rows_kept":22,"cut":false,"hidden":true,"merged":[]}
["Unit Type","% Straight to Hopper","Control type","Yes/NO","Choice","Permit Type","Construction Permit","Raw Material","Enclosure","Material Transfer","Pile Control","Dryer Type","Fermentation Control","Type of solids","Enclosure","Type of Loadout","Loading Type","Tank Content","Tank Orientation","Tank Location","Type of Tank","Type of Primary Seal","Shell Condition","Number of columns","Default Control Equipment","Controlled Units","Boiler Types","NSPS","Fermenter/beerwell","Fermentation Type","Control Type","Control Type","Storage Control type","Ave. Truck Capacity","Input Road Type","Fuel Type","Engine Configuration","Type of Secondary Seal","Internal Shell Conditions","External Shell Color","External Shell Condition","Deck Type","Deck Fitting Category","Results Summary"]
["Truck","0:100","None/Uncontrolled","YES","X","Construction Permit","New Construction","Corn","Enclosed","Front-End Loader","Covered","column dryer","Vent Scrubber","DDGS","Enclosed","Truck","None","Ethanol","Vertical","Above Ground","Fixed Roof","Mechanical Shoe","Light Rust","Self Support",0.95,"Dump Pits","Uncontrolled","Pre-NSPS","Fermenter","Batch Fermentation","None/Uncontrolled","None/Uncontrolled","None/Uncontrolled","ton","Unpaved Low Silt","Natural Gas","2-STROKE LEAN-BURN","Shoe Mounted ","Light Rust","White","Good","Bolted","Typical ","Current PTE, (lb/hr)"]
["Rail Car","10:90","Baghouse","NO",null,"Operating Permit","Existing Plant","Milo","Partially Enclosed","Conveyor","Covered & Supressant","rack dryer","CO2 Scubber","WDGS","Partially Enclosed","Rail Car","Submerged Loading","Denaturant","Horizontal","Under Ground","External Floating Roof","Liquid Mounted","Dense Rust",1,0.99,"Grain Handling","Low Nox burners","Post-NSPS","Beerwell","Continous Fermentation","Scrubber","RTO","Baghouse","gal","Unpaved Medium Silt","Gasoline","4-STROKE LEAN-BURN","Rim Mounted","Dense Rust","Aluminum/ Specular","Poor","Welded","Detail","Current PTE, (ton/yr)"]
[null,"20:80",null,null,null,null,null,"Cellulose","Choke-flow","Dump Truck","None","self‐cleaning screens","No Control",null,"Other","Both","Bottom-Fill Loading","Denatured Ethanol",null,null,"Internal Floating Roof","Vapor Mounted","Gunite Lining",2,null,"Receiving & Handling","Flue Gas recirculation",null,null,null,null,null,"Oiler",null,"Unpaved High Silt","Dual Fuel (95% NG + Diesel","4-STROKE RICH-BURN",null,"Gunite Lining","Aluminum/ Diffuse",null,null,null,"PTE after the project, (lb/hr)"]
[null,"30:70",null,null,null,null,null,"Other","Other","Loadout Spout",null,"other",null,null,null,null,null,"Corrosion Inhibitor",null,null,null,null,null,3,null,null,null,null,null,null,null,null,null,null,"Paved Low Silt",null,null,null,null,"Gray/ Light",null,null,null,"PTE after the project, (ton/yr)"]
[null,"40:60",null,null,null,null,null,null,null,"Other",null,null,null,null,null,null,null,"Hydrochloric Acid",null,null,null,null,null,4,null,null,null,null,null,null,null,null,null,null,"Paved Medium Silt",null,null,null,null,"Gray/ Medium",null,null,null,"Project PTE, (lb/hr)"]
[null,"50:50",null,null,null,null,null,null,null,null,null,null,null,null,null,null,null,null,null,null,null,null,null,5,null,null,null,null,null,null,null,null,null,null,"Paved High Silt",null,null,null,null,"Red/ Prime",null,null,null,"Project PTE, (ton/yr)"]
[null,"60:40",null,null,null,null,null,null,null,null,null,null,null,null,null,null,null,null,null,null,null,null,null,6]
{"$rows_left_out":14}